{"text_format":"1","workbook":"xlsx","n_sheets":4,"sheets":["Uitleg-toelichting","Agendalijst","Beoordeling","Overzicht resultaten"],"not_rendered":{"charts":2,"images":10,"macros":1,"external_links":0,"defined_names":4,"comments":0,"pivot_tables":0},"unopened":[],"bounds":{"document_bytes":16777216,"sheet_cells":100000,"rows_first":2000,"rows_last":500,"rows_between":2000,"halvings":0,"cell_chars":16384,"cell_head_chars":4096},"cells_cut":0,"cells_raw":0,"read":"whole","date_system":"1900"}

{"sheet":"Uitleg-toelichting","index":0,"n_rows":4,"n_cols":2,"rows_kept":4,"cut":false,"hidden":false,"merged":[]}
[]
[]
[]
[null," "]

{"sheet":"Agendalijst","index":1,"n_rows":36,"n_cols":5,"rows_kept":36,"cut":false,"hidden":false,"merged":[]}
["Leerlingenlijst"]
[]
[]
[null,"Naam","eindcijfer"]
[1,"leerling 1",{"$f":"IF(B5<>\"\",'Overzicht resultaten'!C$17,\"\")","v":{"$error":"#REF!"}}]
[{"$f":"A5+1","v":2},"leerling 2",{"$f":"IF(B6<>\"\",'Overzicht resultaten'!D$17,\"\")","v":{"$error":"#REF!"}}]
[{"$f":"A6+1","v":3},"leerling 3",{"$f":"IF(B7<>\"\",'Overzicht resultaten'!E$17,\"\")","v":{"$error":"#REF!"}}]
[4,"leerling 4",{"$f":"IF(B8<>\"\",'Overzicht resultaten'!F$17,\"\")","v":{"$error":"#REF!"}}]
[5,"leerling 5",{"$f":"IF(B9<>\"\",'Overzicht resultaten'!G$17,\"\")","v":{"$error":"#REF!"}}]
[6,"leerling 6",{"$f":"IF(B10<>\"\",'Overzicht resultaten'!H$17,\"\")","v":{"$error":"#REF!"}}]
[7,"leerling 7",{"$f":"IF(B11<>\"\",'Overzicht resultaten'!I$17,\"\")","v":{"$error":"#REF!"}}]
[8,"leerling 8",{"$f":"IF(B12<>\"\",'Overzicht resultaten'!J$17,\"\")","v":{"$error":"#REF!"}}]
[9,"leerling 9",{"$f":"IF(B13<>\"\",'Overzicht resultaten'!K$17,\"\")","v":{"$error":"#REF!"}}]
[10,"leerling 10",{"$f":"IF(B14<>\"\",'Overzicht resultaten'!L$17,\"\")","v":{"$error":"#REF!"}}]
[11,"leerling 11",{"$f":"IF(B15<>\"\",'Overzicht resultaten'!M$17,\"\")","v":{"$error":"#REF!"}}]
[12,null,{"$f":"IF(B16<>\"\",'Overzicht resultaten'!N$17,\"\")","v":""}]
[13,null,{"$f":"IF(B17<>\"\",'Overzicht resultaten'!O$17,\"\")","v":""}]
[14,null,{"$f":"IF(B18<>\"\",'Overzicht resultaten'!P$17,\"\")","v":""}]
[15,null,{"$f":"IF(B19<>\"\",'Overzicht resultaten'!Q$17,\"\")","v":""}]
[16,null,{"$f":"IF(B20<>\"\",'Overzicht resultaten'!R$17,\"\")","v":""}]
[17,null,{"$f":"IF(B21<>\"\",'Overzicht resultaten'!S$17,\"\")","v":""}]
[18,null,{"$f":"IF(B22<>\"\",'Overzicht resultaten'!T$17,\"\")","v":""}]
[19,null,{"$f":"IF(B23<>\"\",'Overzicht resultaten'!U$17,\"\")","v":""}]
[20,null,{"$f":"IF(B24<>\"\",'Overzicht resultaten'!V$17,\"\")","v":""}]
[21,null,{"$f":"IF(B25<>\"\",'Overzicht resultaten'!W$17,\"\")","v":""}]
[22,null,{"$f":"IF(B26<>\"\",'Overzicht resultaten'!X$17,\"\")","v":""}]
[23,null,{"$f":"IF(B27<>\"\",'Overzicht resultaten'!Y$17,\"\")","v":""}]
[24,null,{"$f":"IF(B28<>\"\",'Overzicht resultaten'!Z$17,\"\")","v":""}]
[25,null,{"$f":"IF(B29<>\"\",'Overzicht resultaten'!AA$17,\"\")","v":""}]
[{"$f":"A29+1","v":26},null,{"$f":"IF(B30<>\"\",'Overzicht resultaten'!AB$17,\"\")","v":""},null,{"$f":"IF(B30<>\"\",C30,\"\")","v":""}]
[27,null,{"$f":"IF(B31<>\"\",'Overzicht resultaten'!AC$17,\"\")","v":""},null,""]
[28,null,{"$f":"IF(B32<>\"\",'Overzicht resultaten'!AD$17,\"\")","v":""}]
[29,null,{"$f":"IF(B33<>\"\",'Overzicht resultaten'!AE$17,\"\")","v":""}]
[{"$f":"A33+1","v":30},null,{"$f":"IF(B34<>\"\",'Overzicht resultaten'!AF$17,\"\")","v":""}]
[31,null,{"$f":"IF(B35<>\"\",'Overzicht resultaten'!AG$17,\"\")","v":""}]
[32,null,{"$f":"IF(B36<>\"\",'Overzicht resultaten'!AH$17,\"\")","v":""}]

{"sheet":"Beoordeling","index":2,"n_rows":24,"n_cols":41,"rows_kept":24,"cut":false,"hidden":false,"merged":[]}
[null,"Alle criteria",null,"gewicht per onderdeel","categorie gewicht",{"$f":"'Overzicht resultaten'!C6","v":"leerling 1"},{"$f":"'Overzicht resultaten'!D6","v":"leerling 2"},{"$f":"'Overzicht resultaten'!E6","v":"leerling 3"},{"$f":"'Overzicht resultaten'!F6","v":"leerling 4"},{"$f":"'Overzicht resultaten'!G6","v":"leerling 5"},{"$f":"'Overzicht resultaten'!H6","v":"leerling 6"},{"$f":"'Overzicht resultaten'!I6","v":"leerling 7"},{"$f":"'Overzicht resultaten'!J6","v":"leerling 8"},{"$f":"'Overzicht resultaten'!K6","v":"leerling 9"},{"$f":"'Overzicht resultaten'!L6","v":"leerling 10"},{"$f":"'Overzicht resultaten'!M6","v":"leerling 11"},{"$f":"'Overzicht resultaten'!N6","v":""},{"$f":"'Overzicht resultaten'!O6","v":""},{"$f":"'Overzicht resultaten'!P6","v":""},{"$f":"'Overzicht resultaten'!Q6","v":""},{"$f":"'Overzicht resultaten'!R6","v":""},{"$f":"'Overzicht resultaten'!S6","v":""},{"$f":"'Overzicht resultaten'!T6","v":""},{"$f":"'Overzicht resultaten'!U6","v":""},{"$f":"'Overzicht resultaten'!V6","v":""},{"$f":"'Overzicht resultaten'!W6","v":""},{"$f":"'Overzicht resultaten'!X6","v":""},{"$f":"'Overzicht resultaten'!Y6","v":""},{"$f":"'Overzicht resultaten'!Z6","v":""},{"$f":"'Overzicht resultaten'!AA6","v":""},{"$f":"'Overzicht resultaten'!AB6","v":""},{"$f":"'Overzicht resultaten'!AC6","v":""},{"$f":"'Overzicht resultaten'!AD6","v":""},{"$f":"'Overzicht resultaten'!AE6","v":""},{"$f":"'Overzicht resultaten'!AF6","v":""},{"$f":"'Overzicht resultaten'!AG6","v":""},{"$f":"'Overzicht resultaten'!AH6","v":""},null,null,5]
[null,null,null,null,null,1,{"$f":"F2+1","v":2},{"$f":"G2+1","v":3},4,5,6,7,8,9,10,11,12,13,14,15,16,17,18,19,20,21,22,23,24,25,26,27,28,29,30,31,32,null,null,"x","x"]
[null,null,"A. Structuur en inhoud",null,null,null,null,null,null,null,null,null,null,null,null,null,null,null,null,null,null,null,null,null,null,null,null,null,null,null,null,null,null,null,null,null,null,null,null,"x","x"]
[null,null,null,"gewicht  (0-4)",null,null,null,null,null,null,null,null,null,null,null,null,null,null,null,null,null,null,null,null,null,null,null,null,null,null,null,null,null,null,null,null,null,null,null,"x","x"]
[1,"*","Je beschouwing heeft een (pakkende) titel die de lading dekt.",1,null,null,null,null,null,null,null,null,null,null,null,null,null,null,null,null,null,null,null,null,null,null,null,null,null,null,null,null,null,null,null,null,null,null,null,{"$f":"IF(D$5>0,\"x\",0)","v":"x"},{"$f":"IF(B5=\"*\",\"x\",0)","v":"x"}]
[2,0,"Je beschouwing heeft een inleidende alinea waarin je ingaat op de probleemstelling. ",0,null,null,null,null,null,null,null,null,null,null,null,null,null,null,null,null,null,null,null,null,null,null,null,null,null,null,null,null,null,null,null,null,null,null,null,{"$f":"IF(D$6>0,\"x\",0)","v":0},0]
[3,0,"In je beschouwing ga je in op de verschillende visies die er ten tijde van de Opstand waren op de moord.",0,null,null,null,null,null,null,null,null,null,null,null,null,null,null,null,null,null,null,null,null,null,null,null,null,null,null,null,null,null,null,null,null,null,null,null,{"$f":"IF(D7>0,\"x\",0)","v":0},0]
[4,0,"Je hebt de verschillende visies onderbouwd met informatie die je, zichtbaar, aan de bronnen hebt ontleend.",0,null,null,null,null,null,null,null,null,null,null,null,null,null,null,null,null,null,null,null,null,null,null,null,null,null,null,null,null,null,null,null,null,null,null,null,0,0]
[5,0,"Je hebt functioneel gebruik gemaakt van verbindingswoorden.",0,null,null,null,null,null,null,null,null,null,null,null,null,null,null,null,null,null,null,null,null,null,null,null,null,null,null,null,null,null,null,null,null,null,null,null,0,0]
[6,"*","Je hebt je beschouwing afgerond met een kort slotwoord.",1,null,null,null,null,null,null,null,null,null,null,null,null,null,null,null,null,null,null,null,null,null,null,null,null,null,null,null,null,null,null,null,null,null,null,null,"x","x"]
[7,0,"Je hebt het onderzoeksproces adequaat geëvalueerd.",0,null,null,null,null,null,null,null,null,null,null,null,null,null,null,null,null,null,null,null,null,null,null,null,null,null,null,null,null,null,null,null,null,null,null,null,0,0]
[8,0,"Je hebt het resultaat adequaat geëvalueerd.",0,null,null,null,null,null,null,null,null,null,null,null,null,null,null,null,null,null,null,null,null,null,null,null,null,null,null,null,null,null,null,null,null,null,null,null,0,0]
[9,0,"zelf invullen ...",0,null,null,null,null,null,null,null,null,null,null,null,null,null,null,null,null,null,null,null,null,null,null,null,null,null,null,null,null,null,null,null,null,null,null,null,0,0]
[null,null,null,null,1,{"$f":"IF(AND(SUM($D$5:$D$13)>0,$E$14>0),VALUE(SUMPRODUCT($D$5:$D$13*F5:F13)*100/(4*SUM($D$5:$D$13))),0)","v":0},0,0,0,0,0,0,0,0,0,0,0,0,0,0,0,0,0,0,0,0,0,0,0,0,0,0,0,0,0,0,0,null,null,"x","x"]
[null,null,"B. Taalgebruik",null,null,null,null,null,null,null,null,null,null,null,null,null,null,null,null,null,null,null,null,null,null,null,null,null,null,null,null,null,null,null,null,null,null,null,null,"x","x"]
[null,null,null,"gewicht",null,null,null,null,null,null,null,null,null,null,null,null,null,null,null,null,null,null,null,null,null,null,null,null,null,null,null,null,null,null,null,null,null,null,null,"x","x"]
[10,"*","Het taalgebruik in je essay/betoog/beschouwing is uitstekend. Dit betekent dat:",1,null,null,null,null,null,null,null,null,null,null,null,null,null,null,null,null,null,null,null,null,null,null,null,null,null,null,null,null,null,null,null,null,null,null,null,{"$f":"IF(D17>0,\"x\",0)","v":"x"},"x"]
[11,0,"je essay/betoog/beschouwing een heldere opbouw heeft;",0,null,null,null,null,null,null,null,null,null,null,null,null,null,null,null,null,null,null,null,null,null,null,null,null,null,null,null,null,null,null,null,null,null,null,null,0,0]
[12,0,"opeenvolgende zinnen in je essay/betoog/beschouwing inhoudelijk met elkaar in verband staan; ",0,null,null,null,null,null,null,null,null,null,null,null,null,null,null,null,null,null,null,null,null,null,null,null,null,null,null,null,null,null,null,null,null,null,null,null,0,0]
[13,0,"je essay/betoog/beschouwing geen grammaticale fouten bevat;",0,null,null,null,null,null,null,null,null,null,null,null,null,null,null,null,null,null,null,null,null,null,null,null,null,null,null,null,null,null,null,null,null,null,null,null,0,0]
[14,0,"de interpunctie naar behoren is;",0,null,null,null,null,null,null,null,null,null,null,null,null,null,null,null,null,null,null,null,null,null,null,null,null,null,null,null,null,null,null,null,null,null,null,null,0,0]
[15,0,"de spelling in orde is.",0,null,null,null,null,null,null,null,null,null,null,null,null,null,null,null,null,null,null,null,null,null,null,null,null,null,null,null,null,null,null,null,null,null,null,null,0,0]
[16,0,"zelf invullen ...",0,null,null,null,null,null,null,null,null,null,null,null,null,null,null,null,null,null,null,null,null,null,null,null,null,null,null,null,null,null,null,null,null,null,null,null,0,0]
[null,null,null,null,2,{"$f":"IF(AND(SUM($D$17:$D$23)>0,$E$24>0),VALUE(SUMPRODUCT($D$17:$D$23*F17:F23)*100/(4*SUM($D$17:$D$23))),0)","v":0},0,0,0,0,0,0,0,0,0,0,0,0,0,0,0,0,0,0,0,0,0,0,0,0,0,0,0,0,0,0,0,null,null,"x","x"]

{"sheet":"Overzicht resultaten","index":3,"n_rows":17,"n_cols":36,"rows_kept":17,"cut":false,"hidden":false,"merged":[]}
[]
[null,null,null,"Overzicht resultaten: niets invullen!"]
[]
[]
[null,null,1,{"$f":"C5+1","v":2},{"$f":"D5+1","v":3},4,5,6,7,8,9,10,11,12,13,14,15,16,17,18,19,20,21,22,23,24,25,26,27,28,29,30,{"$f":"AF5+1","v":31},32,null,"gemiddelde"]
["weging","categorie",{"$f":"IF(Agendalijst!B5=\"\",\"\",Agendalijst!B5)","v":"leerling 1"},{"$f":"IF(Agendalijst!B6=\"\",\"\",Agendalijst!B6)","v":"leerling 2"},{"$f":"IF(Agendalijst!B7=\"\",\"\",Agendalijst!B7)","v":"leerling 3"},{"$f":"IF(Agendalijst!B8=\"\",\"\",Agendalijst!B8)","v":"leerling 4"},{"$f":"IF(Agendalijst!B9=\"\",\"\",Agendalijst!B9)","v":"leerling 5"},{"$f":"IF(Agendalijst!B10=\"\",\"\",Agendalijst!B10)","v":"leerling 6"},{"$f":"IF(Agendalijst!B11=\"\",\"\",Agendalijst!B11)","v":"leerling 7"},{"$f":"IF(Agendalijst!B12=\"\",\"\",Agendalijst!B12)","v":"leerling 8"},{"$f":"IF(Agendalijst!B13=\"\",\"\",Agendalijst!B13)","v":"leerling 9"},{"$f":"IF(Agendalijst!B14=\"\",\"\",Agendalijst!B14)","v":"leerling 10"},{"$f":"IF(Agendalijst!B15=\"\",\"\",Agendalijst!B15)","v":"leerling 11"},{"$f":"IF(Agendalijst!B16=\"\",\"\",Agendalijst!B16)","v":""},{"$f":"IF(Agendalijst!B17=\"\",\"\",Agendalijst!B17)","v":""},{"$f":"IF(Agendalijst!B18=\"\",\"\",Agendalijst!B18)","v":""},{"$f":"IF(Agendalijst!B19=\"\",\"\",Agendalijst!B19)","v":""},{"$f":"IF(Agendalijst!B20=\"\",\"\",Agendalijst!B20)","v":""},{"$f":"IF(Agendalijst!B21=\"\",\"\",Agendalijst!B21)","v":""},{"$f":"IF(Agendalijst!B22=\"\",\"\",Agendalijst!B22)","v":""},{"$f":"IF(Agendalijst!B23=\"\",\"\",Agendalijst!B23)","v":""},{"$f":"IF(Agendalijst!B24=\"\",\"\",Agendalijst!B24)","v":""},{"$f":"IF(Agendalijst!B25=\"\",\"\",Agendalijst!B25)","v":""},{"$f":"IF(Agendalijst!B26=\"\",\"\",Agendalijst!B26)","v":""},{"$f":"IF(Agendalijst!B27=\"\",\"\",Agendalijst!B27)","v":""},{"$f":"IF(Agendalijst!B28=\"\",\"\",Agendalijst!B28)","v":""},{"$f":"IF(Agendalijst!B29=\"\",\"\",Agendalijst!B29)","v":""},{"$f":"IF(Agendalijst!B30=\"\",\"\",Agendalijst!B30)","v":""},{"$f":"IF(Agendalijst!B31=\"\",\"\",Agendalijst!B31)","v":""},{"$f":"IF(Agendalijst!B32=\"\",\"\",Agendalijst!B32)","v":""},{"$f":"IF(Agendalijst!B33=\"\",\"\",Agendalijst!B33)","v":""},{"$f":"IF(Agendalijst!B34=\"\",\"\",Agendalijst!B34)","v":""},{"$f":"IF(Agendalijst!B35=\"\",\"\",Agendalijst!B35)","v":""},{"$f":"IF(Agendalijst!B36=\"\",\"\",Agendalijst!B36)","v":""},null,"klas"]
[{"$f":"Beoordeling!E14","v":1},"A",{"$f":"IF(AND($A7>0,C6<>\"\"),Beoordeling!F14,\"\")","v":0},{"$f":"IF(AND($A7>0,D6<>\"\"),Beoordeling!G14,\"\")","v":0},{"$f":"IF(AND($A7>0,E6<>\"\"),Beoordeling!H14,\"\")","v":0},{"$f":"IF(AND($A7>0,F6<>\"\"),Beoordeling!I14,\"\")","v":0},{"$f":"IF(AND($A7>0,G6<>\"\"),Beoordeling!J14,\"\")","v":0},{"$f":"IF(AND($A7>0,H6<>\"\"),Beoordeling!K14,\"\")","v":0},{"$f":"IF(AND($A7>0,I6<>\"\"),Beoordeling!L14,\"\")","v":0},{"$f":"IF(AND($A7>0,J6<>\"\"),Beoordeling!M14,\"\")","v":0},{"$f":"IF(AND($A7>0,K6<>\"\"),Beoordeling!N14,\"\")","v":0},{"$f":"IF(AND($A7>0,L6<>\"\"),Beoordeling!O14,\"\")","v":0},{"$f":"IF(AND($A7>0,M6<>\"\"),Beoordeling!P14,\"\")","v":0},{"$f":"IF(AND($A7>0,N6<>\"\"),Beoordeling!Q14,\"\")","v":""},{"$f":"IF(AND($A7>0,O6<>\"\"),Beoordeling!R14,\"\")","v":""},{"$f":"IF(AND($A7>0,P6<>\"\"),Beoordeling!S14,\"\")","v":""},{"$f":"IF(AND($A7>0,Q6<>\"\"),Beoordeling!T14,\"\")","v":""},{"$f":"IF(AND($A7>0,R6<>\"\"),Beoordeling!U14,\"\")","v":""},{"$f":"IF(AND($A7>0,S6<>\"\"),Beoordeling!V14,\"\")","v":""},{"$f":"IF(AND($A7>0,T6<>\"\"),Beoordeling!W14,\"\")","v":""},{"$f":"IF(AND($A7>0,U6<>\"\"),Beoordeling!X14,\"\")","v":""},{"$f":"IF(AND($A7>0,V6<>\"\"),Beoordeling!Y14,\"\")","v":""},{"$f":"IF(AND($A7>0,W6<>\"\"),Beoordeling!Z14,\"\")","v":""},{"$f":"IF(AND($A7>0,X6<>\"\"),Beoordeling!AA14,\"\")","v":""},{"$f":"IF(AND($A7>0,Y6<>\"\"),Beoordeling!AB14,\"\")","v":""},{"$f":"IF(AND($A7>0,Z6<>\"\"),Beoordeling!AC14,\"\")","v":""},{"$f":"IF(AND($A7>0,AA6<>\"\"),Beoordeling!AD14,\"\")","v":""},{"$f":"IF(AND($A7>0,AB6<>\"\"),Beoordeling!AE14,\"\")","v":""},{"$f":"IF(AND($A7>0,AC6<>\"\"),Beoordeling!AF14,\"\")","v":""},{"$f":"IF(AND($A7>0,AD6<>\"\"),Beoordeling!AG14,\"\")","v":""},{"$f":"IF(AND($A7>0,AE6<>\"\"),Beoordeling!AH14,\"\")","v":""},{"$f":"IF(AND($A7>0,AF6<>\"\"),Beoordeling!AI14,\"\")","v":""},{"$f":"IF(AND($A7>0,AG6<>\"\"),Beoordeling!AJ14,\"\")","v":""},{"$f":"IF(AND($A7>0,AH6<>\"\"),Beoordeling!AK14,\"\")","v":""},null,{"$f":"IF(A7>0,AVERAGE(C7:AH7),\"-\")","v":0}]
[{"$f":"Beoordeling!E24","v":2},"B",{"$f":"IF(AND($A$8>0,C6<>\"\"),Beoordeling!F24,\"\")","v":0},{"$f":"IF(AND($A$8>0,D6<>\"\"),Beoordeling!G24,\"\")","v":0},{"$f":"IF(AND($A$8>0,E6<>\"\"),Beoordeling!H24,\"\")","v":0},{"$f":"IF(AND($A$8>0,F6<>\"\"),Beoordeling!I24,\"\")","v":0},{"$f":"IF(AND($A$8>0,G6<>\"\"),Beoordeling!J24,\"\")","v":0},{"$f":"IF(AND($A$8>0,H6<>\"\"),Beoordeling!K24,\"\")","v":0},{"$f":"IF(AND($A$8>0,I6<>\"\"),Beoordeling!L24,\"\")","v":0},{"$f":"IF(AND($A$8>0,J6<>\"\"),Beoordeling!M24,\"\")","v":0},{"$f":"IF(AND($A$8>0,K6<>\"\"),Beoordeling!N24,\"\")","v":0},{"$f":"IF(AND($A$8>0,L6<>\"\"),Beoordeling!O24,\"\")","v":0},{"$f":"IF(AND($A$8>0,M6<>\"\"),Beoordeling!P24,\"\")","v":0},{"$f":"IF(AND($A$8>0,N6<>\"\"),Beoordeling!Q24,\"\")","v":""},{"$f":"IF(AND($A$8>0,O6<>\"\"),Beoordeling!R24,\"\")","v":""},{"$f":"IF(AND($A$8>0,P6<>\"\"),Beoordeling!S24,\"\")","v":""},{"$f":"IF(AND($A$8>0,Q6<>\"\"),Beoordeling!T24,\"\")","v":""},{"$f":"IF(AND($A$8>0,R6<>\"\"),Beoordeling!U24,\"\")","v":""},{"$f":"IF(AND($A$8>0,S6<>\"\"),Beoordeling!V24,\"\")","v":""},{"$f":"IF(AND($A$8>0,T6<>\"\"),Beoordeling!W24,\"\")","v":""},{"$f":"IF(AND($A$8>0,U6<>\"\"),Beoordeling!X24,\"\")","v":""},{"$f":"IF(AND($A$8>0,V6<>\"\"),Beoordeling!Y24,\"\")","v":""},{"$f":"IF(AND($A$8>0,W6<>\"\"),Beoordeling!Z24,\"\")","v":""},{"$f":"IF(AND($A$8>0,X6<>\"\"),Beoordeling!AA24,\"\")","v":""},{"$f":"IF(AND($A$8>0,Y6<>\"\"),Beoordeling!AB24,\"\")","v":""},{"$f":"IF(AND($A$8>0,Z6<>\"\"),Beoordeling!AC24,\"\")","v":""},{"$f":"IF(AND($A$8>0,AA6<>\"\"),Beoordeling!AD24,\"\")","v":""},{"$f":"IF(AND($A$8>0,AB6<>\"\"),Beoordeling!AE24,\"\")","v":""},{"$f":"IF(AND($A$8>0,AC6<>\"\"),Beoordeling!AF24,\"\")","v":""},{"$f":"IF(AND($A$8>0,AD6<>\"\"),Beoordeling!AG24,\"\")","v":""},{"$f":"IF(AND($A$8>0,AE6<>\"\"),Beoordeling!AH24,\"\")","v":""},{"$f":"IF(AND($A$8>0,AF6<>\"\"),Beoordeling!AI24,\"\")","v":""},{"$f":"IF(AND($A$8>0,AG6<>\"\"),Beoordeling!AJ24,\"\")","v":""},{"$f":"IF(AND($A$8>0,AH6<>\"\"),Beoordeling!AK24,\"\")","v":""},null,{"$f":"IF(A8>0,AVERAGE(C8:AH8),\"-\")","v":0}]
[{"$f":"Beoordeling!#REF!","v":{"$error":"#REF!"}},"C",{"$f":"IF(AND($A$9>0,C6<>\"\"),Beoordeling!#REF!,\"\")","v":{"$error":"#REF!"}},{"$f":"IF(AND($A$9>0,D6<>\"\"),Beoordeling!#REF!,\"\")","v":{"$error":"#REF!"}},{"$f":"IF(AND($A$9>0,E6<>\"\"),Beoordeling!#REF!,\"\")","v":{"$error":"#REF!"}},{"$f":"IF(AND($A$9>0,F6<>\"\"),Beoordeling!#REF!,\"\")","v":{"$error":"#REF!"}},{"$f":"IF(AND($A$9>0,G6<>\"\"),Beoordeling!#REF!,\"\")","v":{"$error":"#REF!"}},{"$f":"IF(AND($A$9>0,H6<>\"\"),Beoordeling!#REF!,\"\")","v":{"$error":"#REF!"}},{"$f":"IF(AND($A$9>0,I6<>\"\"),Beoordeling!#REF!,\"\")","v":{"$error":"#REF!"}},{"$f":"IF(AND($A$9>0,J6<>\"\"),Beoordeling!#REF!,\"\")","v":{"$error":"#REF!"}},{"$f":"IF(AND($A$9>0,K6<>\"\"),Beoordeling!#REF!,\"\")","v":{"$error":"#REF!"}},{"$f":"IF(AND($A$9>0,L6<>\"\"),Beoordeling!#REF!,\"\")","v":{"$error":"#REF!"}},{"$f":"IF(AND($A$9>0,M6<>\"\"),Beoordeling!#REF!,\"\")","v":{"$error":"#REF!"}},{"$f":"IF(AND($A$9>0,N6<>\"\"),Beoordeling!#REF!,\"\")","v":{"$error":"#REF!"}},{"$f":"IF(AND($A$9>0,O6<>\"\"),Beoordeling!#REF!,\"\")","v":{"$error":"#REF!"}},{"$f":"IF(AND($A$9>0,P6<>\"\"),Beoordeling!#REF!,\"\")","v":{"$error":"#REF!"}},{"$f":"IF(AND($A$9>0,Q6<>\"\"),Beoordeling!#REF!,\"\")","v":{"$error":"#REF!"}},{"$f":"IF(AND($A$9>0,R6<>\"\"),Beoordeling!#REF!,\"\")","v":{"$error":"#REF!"}},{"$f":"IF(AND($A$9>0,S6<>\"\"),Beoordeling!#REF!,\"\")","v":{"$error":"#REF!"}},{"$f":"IF(AND($A$9>0,T6<>\"\"),Beoordeling!#REF!,\"\")","v":{"$error":"#REF!"}},{"$f":"IF(AND($A$9>0,U6<>\"\"),Beoordeling!#REF!,\"\")","v":{"$error":"#REF!"}},{"$f":"IF(AND($A$9>0,V6<>\"\"),Beoordeling!#REF!,\"\")","v":{"$error":"#REF!"}},{"$f":"IF(AND($A$9>0,W6<>\"\"),Beoordeling!#REF!,\"\")","v":{"$error":"#REF!"}},{"$f":"IF(AND($A$9>0,X6<>\"\"),Beoordeling!#REF!,\"\")","v":{"$error":"#REF!"}},{"$f":"IF(AND($A$9>0,Y6<>\"\"),Beoordeling!#REF!,\"\")","v":{"$error":"#REF!"}},{"$f":"IF(AND($A$9>0,Z6<>\"\"),Beoordeling!#REF!,\"\")","v":{"$error":"#REF!"}},{"$f":"IF(AND($A$9>0,AA6<>\"\"),Beoordeling!#REF!,\"\")","v":{"$error":"#REF!"}},{"$f":"IF(AND($A$9>0,AB6<>\"\"),Beoordeling!#REF!,\"\")","v":{"$error":"#REF!"}},{"$f":"IF(AND($A$9>0,AC6<>\"\"),Beoordeling!#REF!,\"\")","v":{"$error":"#REF!"}},{"$f":"IF(AND($A$9>0,AD6<>\"\"),Beoordeling!#REF!,\"\")","v":{"$error":"#REF!"}},{"$f":"IF(AND($A$9>0,AE6<>\"\"),Beoordeling!#REF!,\"\")","v":{"$error":"#REF!"}},{"$f":"IF(AND($A$9>0,AF6<>\"\"),Beoordeling!#REF!,\"\")","v":{"$error":"#REF!"}},{"$f":"IF(AND($A$9>0,AG6<>\"\"),Beoordeling!#REF!,\"\")","v":{"$error":"#REF!"}},{"$f":"IF(AND($A$9>0,AH6<>\"\"),Beoordeling!#REF!,\"\")","v":{"$error":"#REF!"}},null,{"$error":"#REF!"}]
[{"$f":"Beoordeling!#REF!","v":{"$error":"#REF!"}},"D",{"$f":"IF(AND($A$10>0,C6<>\"\"),Beoordeling!#REF!,\"\")","v":{"$error":"#REF!"}},{"$f":"IF(AND($A$10>0,D6<>\"\"),Beoordeling!#REF!,\"\")","v":{"$error":"#REF!"}},{"$f":"IF(AND($A$10>0,E6<>\"\"),Beoordeling!#REF!,\"\")","v":{"$error":"#REF!"}},{"$f":"IF(AND($A$10>0,F6<>\"\"),Beoordeling!#REF!,\"\")","v":{"$error":"#REF!"}},{"$f":"IF(AND($A$10>0,G6<>\"\"),Beoordeling!#REF!,\"\")","v":{"$error":"#REF!"}},{"$f":"IF(AND($A$10>0,H6<>\"\"),Beoordeling!#REF!,\"\")","v":{"$error":"#REF!"}},{"$f":"IF(AND($A$10>0,I6<>\"\"),Beoordeling!#REF!,\"\")","v":{"$error":"#REF!"}},{"$f":"IF(AND($A$10>0,J6<>\"\"),Beoordeling!#REF!,\"\")","v":{"$error":"#REF!"}},{"$f":"IF(AND($A$10>0,K6<>\"\"),Beoordeling!#REF!,\"\")","v":{"$error":"#REF!"}},{"$f":"IF(AND($A$10>0,L6<>\"\"),Beoordeling!#REF!,\"\")","v":{"$error":"#REF!"}},{"$f":"IF(AND($A$10>0,M6<>\"\"),Beoordeling!#REF!,\"\")","v":{"$error":"#REF!"}},{"$f":"IF(AND($A$10>0,N6<>\"\"),Beoordeling!#REF!,\"\")","v":{"$error":"#REF!"}},{"$f":"IF(AND($A$10>0,O6<>\"\"),Beoordeling!#REF!,\"\")","v":{"$error":"#REF!"}},{"$f":"IF(AND($A$10>0,P6<>\"\"),Beoordeling!#REF!,\"\")","v":{"$error":"#REF!"}},{"$f":"IF(AND($A$10>0,Q6<>\"\"),Beoordeling!#REF!,\"\")","v":{"$error":"#REF!"}},{"$f":"IF(AND($A$10>0,R6<>\"\"),Beoordeling!#REF!,\"\")","v":{"$error":"#REF!"}},{"$f":"IF(AND($A$10>0,S6<>\"\"),Beoordeling!#REF!,\"\")","v":{"$error":"#REF!"}},{"$f":"IF(AND($A$10>0,T6<>\"\"),Beoordeling!#REF!,\"\")","v":{"$error":"#REF!"}},{"$f":"IF(AND($A$10>0,U6<>\"\"),Beoordeling!#REF!,\"\")","v":{"$error":"#REF!"}},{"$f":"IF(AND($A$10>0,V6<>\"\"),Beoordeling!#REF!,\"\")","v":{"$error":"#REF!"}},{"$f":"IF(AND($A$10>0,W6<>\"\"),Beoordeling!#REF!,\"\")","v":{"$error":"#REF!"}},{"$f":"IF(AND($A$10>0,X6<>\"\"),Beoordeling!#REF!,\"\")","v":{"$error":"#REF!"}},{"$f":"IF(AND($A$10>0,Y6<>\"\"),Beoordeling!#REF!,\"\")","v":{"$error":"#REF!"}},{"$f":"IF(AND($A$10>0,Z6<>\"\"),Beoordeling!#REF!,\"\")","v":{"$error":"#REF!"}},{"$f":"IF(AND($A$10>0,AA6<>\"\"),Beoordeling!#REF!,\"\")","v":{"$error":"#REF!"}},{"$f":"IF(AND($A$10>0,AB6<>\"\"),Beoordeling!#REF!,\"\")","v":{"$error":"#REF!"}},{"$f":"IF(AND($A$10>0,AC6<>\"\"),Beoordeling!#REF!,\"\")","v":{"$error":"#REF!"}},{"$f":"IF(AND($A$10>0,AD6<>\"\"),Beoordeling!#REF!,\"\")","v":{"$error":"#REF!"}},{"$f":"IF(AND($A$10>0,AE6<>\"\"),Beoordeling!#REF!,\"\")","v":{"$error":"#REF!"}},{"$f":"IF(AND($A$10>0,AF6<>\"\"),Beoordeling!#REF!,\"\")","v":{"$error":"#REF!"}},{"$f":"IF(AND($A$10>0,AG6<>\"\"),Beoordeling!#REF!,\"\")","v":{"$error":"#REF!"}},{"$f":"IF(AND($A$10>0,AH6<>\"\"),Beoordeling!#REF!,\"\")","v":{"$error":"#REF!"}},null,{"$error":"#REF!"}]
[{"$f":"Beoordeling!#REF!","v":{"$error":"#REF!"}},"E",{"$f":"IF(AND($A$11>0,C6<>\"\"),Beoordeling!#REF!,\"\")","v":{"$error":"#REF!"}},{"$f":"IF(AND($A$11>0,D6<>\"\"),Beoordeling!#REF!,\"\")","v":{"$error":"#REF!"}},{"$f":"IF(AND($A$11>0,E6<>\"\"),Beoordeling!#REF!,\"\")","v":{"$error":"#REF!"}},{"$f":"IF(AND($A$11>0,F6<>\"\"),Beoordeling!#REF!,\"\")","v":{"$error":"#REF!"}},{"$f":"IF(AND($A$11>0,G6<>\"\"),Beoordeling!#REF!,\"\")","v":{"$error":"#REF!"}},{"$f":"IF(AND($A$11>0,H6<>\"\"),Beoordeling!#REF!,\"\")","v":{"$error":"#REF!"}},{"$f":"IF(AND($A$11>0,I6<>\"\"),Beoordeling!#REF!,\"\")","v":{"$error":"#REF!"}},{"$f":"IF(AND($A$11>0,J6<>\"\"),Beoordeling!#REF!,\"\")","v":{"$error":"#REF!"}},{"$f":"IF(AND($A$11>0,K6<>\"\"),Beoordeling!#REF!,\"\")","v":{"$error":"#REF!"}},{"$f":"IF(AND($A$11>0,L6<>\"\"),Beoordeling!#REF!,\"\")","v":{"$error":"#REF!"}},{"$f":"IF(AND($A$11>0,M6<>\"\"),Beoordeling!#REF!,\"\")","v":{"$error":"#REF!"}},{"$f":"IF(AND($A$11>0,N6<>\"\"),Beoordeling!#REF!,\"\")","v":{"$error":"#REF!"}},{"$f":"IF(AND($A$11>0,O6<>\"\"),Beoordeling!#REF!,\"\")","v":{"$error":"#REF!"}},{"$f":"IF(AND($A$11>0,P6<>\"\"),Beoordeling!#REF!,\"\")","v":{"$error":"#REF!"}},{"$f":"IF(AND($A$11>0,Q6<>\"\"),Beoordeling!#REF!,\"\")","v":{"$error":"#REF!"}},{"$f":"IF(AND($A$11>0,R6<>\"\"),Beoordeling!#REF!,\"\")","v":{"$error":"#REF!"}},{"$f":"IF(AND($A$11>0,S6<>\"\"),Beoordeling!#REF!,\"\")","v":{"$error":"#REF!"}},{"$f":"IF(AND($A$11>0,T6<>\"\"),Beoordeling!#REF!,\"\")","v":{"$error":"#REF!"}},{"$f":"IF(AND($A$11>0,U6<>\"\"),Beoordeling!#REF!,\"\")","v":{"$error":"#REF!"}},{"$f":"IF(AND($A$11>0,V6<>\"\"),Beoordeling!#REF!,\"\")","v":{"$error":"#REF!"}},{"$f":"IF(AND($A$11>0,W6<>\"\"),Beoordeling!#REF!,\"\")","v":{"$error":"#REF!"}},{"$f":"IF(AND($A$11>0,X6<>\"\"),Beoordeling!#REF!,\"\")","v":{"$error":"#REF!"}},{"$f":"IF(AND($A$11>0,Y6<>\"\"),Beoordeling!#REF!,\"\")","v":{"$error":"#REF!"}},{"$f":"IF(AND($A$11>0,Z6<>\"\"),Beoordeling!#REF!,\"\")","v":{"$error":"#REF!"}},{"$f":"IF(AND($A$11>0,AA6<>\"\"),Beoordeling!#REF!,\"\")","v":{"$error":"#REF!"}},{"$f":"IF(AND($A$11>0,AB6<>\"\"),Beoordeling!#REF!,\"\")","v":{"$error":"#REF!"}},{"$f":"IF(AND($A$11>0,AC6<>\"\"),Beoordeling!#REF!,\"\")","v":{"$error":"#REF!"}},{"$f":"IF(AND($A$11>0,AD6<>\"\"),Beoordeling!#REF!,\"\")","v":{"$error":"#REF!"}},{"$f":"IF(AND($A$11>0,AE6<>\"\"),Beoordeling!#REF!,\"\")","v":{"$error":"#REF!"}},{"$f":"IF(AND($A$11>0,AF6<>\"\"),Beoordeling!#REF!,\"\")","v":{"$error":"#REF!"}},{"$f":"IF(AND($A$11>0,AG6<>\"\"),Beoordeling!#REF!,\"\")","v":{"$error":"#REF!"}},{"$f":"IF(AND($A$11>0,AH6<>\"\"),Beoordeling!#REF!,\"\")","v":{"$error":"#REF!"}},null,{"$error":"#REF!"}]
[{"$f":"Beoordeling!#REF!","v":{"$error":"#REF!"}},"F",{"$f":"IF(AND($A$12>0,C6<>\"\"),Beoordeling!#REF!,\"\")","v":{"$error":"#REF!"}},{"$f":"IF(AND($A$12>0,D6<>\"\"),Beoordeling!#REF!,\"\")","v":{"$error":"#REF!"}},{"$f":"IF(AND($A$12>0,E6<>\"\"),Beoordeling!#REF!,\"\")","v":{"$error":"#REF!"}},{"$f":"IF(AND($A$12>0,F6<>\"\"),Beoordeling!#REF!,\"\")","v":{"$error":"#REF!"}},{"$f":"IF(AND($A$12>0,G6<>\"\"),Beoordeling!#REF!,\"\")","v":{"$error":"#REF!"}},{"$f":"IF(AND($A$12>0,H6<>\"\"),Beoordeling!#REF!,\"\")","v":{"$error":"#REF!"}},{"$f":"IF(AND($A$12>0,I6<>\"\"),Beoordeling!#REF!,\"\")","v":{"$error":"#REF!"}},{"$f":"IF(AND($A$12>0,J6<>\"\"),Beoordeling!#REF!,\"\")","v":{"$error":"#REF!"}},{"$f":"IF(AND($A$12>0,K6<>\"\"),Beoordeling!#REF!,\"\")","v":{"$error":"#REF!"}},{"$f":"IF(AND($A$12>0,L6<>\"\"),Beoordeling!#REF!,\"\")","v":{"$error":"#REF!"}},{"$f":"IF(AND($A$12>0,M6<>\"\"),Beoordeling!#REF!,\"\")","v":{"$error":"#REF!"}},{"$f":"IF(AND($A$12>0,N6<>\"\"),Beoordeling!#REF!,\"\")","v":{"$error":"#REF!"}},{"$f":"IF(AND($A$12>0,O6<>\"\"),Beoordeling!#REF!,\"\")","v":{"$error":"#REF!"}},{"$f":"IF(AND($A$12>0,P6<>\"\"),Beoordeling!#REF!,\"\")","v":{"$error":"#REF!"}},{"$f":"IF(AND($A$12>0,Q6<>\"\"),Beoordeling!#REF!,\"\")","v":{"$error":"#REF!"}},{"$f":"IF(AND($A$12>0,R6<>\"\"),Beoordeling!#REF!,\"\")","v":{"$error":"#REF!"}},{"$f":"IF(AND($A$12>0,S6<>\"\"),Beoordeling!#REF!,\"\")","v":{"$error":"#REF!"}},{"$f":"IF(AND($A$12>0,T6<>\"\"),Beoordeling!#REF!,\"\")","v":{"$error":"#REF!"}},{"$f":"IF(AND($A$12>0,U6<>\"\"),Beoordeling!#REF!,\"\")","v":{"$error":"#REF!"}},{"$f":"IF(AND($A$12>0,V6<>\"\"),Beoordeling!#REF!,\"\")","v":{"$error":"#REF!"}},{"$f":"IF(AND($A$12>0,W6<>\"\"),Beoordeling!#REF!,\"\")","v":{"$error":"#REF!"}},{"$f":"IF(AND($A$12>0,X6<>\"\"),Beoordeling!#REF!,\"\")","v":{"$error":"#REF!"}},{"$f":"IF(AND($A$12>0,Y6<>\"\"),Beoordeling!#REF!,\"\")","v":{"$error":"#REF!"}},{"$f":"IF(AND($A$12>0,Z6<>\"\"),Beoordeling!#REF!,\"\")","v":{"$error":"#REF!"}},{"$f":"IF(AND($A$12>0,AA6<>\"\"),Beoordeling!#REF!,\"\")","v":{"$error":"#REF!"}},{"$f":"IF(AND($A$12>0,AB6<>\"\"),Beoordeling!#REF!,\"\")","v":{"$error":"#REF!"}},{"$f":"IF(AND($A$12>0,AC6<>\"\"),Beoordeling!#REF!,\"\")","v":{"$error":"#REF!"}},{"$f":"IF(AND($A$12>0,AD6<>\"\"),Beoordeling!#REF!,\"\")","v":{"$error":"#REF!"}},{"$f":"IF(AND($A$12>0,AE6<>\"\"),Beoordeling!#REF!,\"\")","v":{"$error":"#REF!"}},{"$f":"IF(AND($A$12>0,AF6<>\"\"),Beoordeling!#REF!,\"\")","v":{"$error":"#REF!"}},{"$f":"IF(AND($A$12>0,AG6<>\"\"),Beoordeling!#REF!,\"\")","v":{"$error":"#REF!"}},{"$f":"IF(AND($A$12>0,AH6<>\"\"),Beoordeling!#REF!,\"\")","v":{"$error":"#REF!"}},null,{"$error":"#REF!"}]
[{"$f":"Beoordeling!#REF!","v":{"$error":"#REF!"}},"G",{"$f":"IF(AND($A$13>0,C6<>\"\"),Beoordeling!#REF!,\"\")","v":{"$error":"#REF!"}},{"$f":"IF(AND($A$13>0,D6<>\"\"),Beoordeling!#REF!,\"\")","v":{"$error":"#REF!"}},{"$f":"IF(AND($A$13>0,E6<>\"\"),Beoordeling!#REF!,\"\")","v":{"$error":"#REF!"}},{"$f":"IF(AND($A$13>0,F6<>\"\"),Beoordeling!#REF!,\"\")","v":{"$error":"#REF!"}},{"$f":"IF(AND($A$13>0,G6<>\"\"),Beoordeling!#REF!,\"\")","v":{"$error":"#REF!"}},{"$f":"IF(AND($A$13>0,H6<>\"\"),Beoordeling!#REF!,\"\")","v":{"$error":"#REF!"}},{"$f":"IF(AND($A$13>0,I6<>\"\"),Beoordeling!#REF!,\"\")","v":{"$error":"#REF!"}},{"$f":"IF(AND($A$13>0,J6<>\"\"),Beoordeling!#REF!,\"\")","v":{"$error":"#REF!"}},{"$f":"IF(AND($A$13>0,K6<>\"\"),Beoordeling!#REF!,\"\")","v":{"$error":"#REF!"}},{"$f":"IF(AND($A$13>0,L6<>\"\"),Beoordeling!#REF!,\"\")","v":{"$error":"#REF!"}},{"$f":"IF(AND($A$13>0,M6<>\"\"),Beoordeling!#REF!,\"\")","v":{"$error":"#REF!"}},{"$f":"IF(AND($A$13>0,N6<>\"\"),Beoordeling!#REF!,\"\")","v":{"$error":"#REF!"}},{"$f":"IF(AND($A$13>0,O6<>\"\"),Beoordeling!#REF!,\"\")","v":{"$error":"#REF!"}},{"$f":"IF(AND($A$13>0,P6<>\"\"),Beoordeling!#REF!,\"\")","v":{"$error":"#REF!"}},{"$f":"IF(AND($A$13>0,Q6<>\"\"),Beoordeling!#REF!,\"\")","v":{"$error":"#REF!"}},{"$f":"IF(AND($A$13>0,R6<>\"\"),Beoordeling!#REF!,\"\")","v":{"$error":"#REF!"}},{"$f":"IF(AND($A$13>0,S6<>\"\"),Beoordeling!#REF!,\"\")","v":{"$error":"#REF!"}},{"$f":"IF(AND($A$13>0,T6<>\"\"),Beoordeling!#REF!,\"\")","v":{"$error":"#REF!"}},{"$f":"IF(AND($A$13>0,U6<>\"\"),Beoordeling!#REF!,\"\")","v":{"$error":"#REF!"}},{"$f":"IF(AND($A$13>0,V6<>\"\"),Beoordeling!#REF!,\"\")","v":{"$error":"#REF!"}},{"$f":"IF(AND($A$13>0,W6<>\"\"),Beoordeling!#REF!,\"\")","v":{"$error":"#REF!"}},{"$f":"IF(AND($A$13>0,X6<>\"\"),Beoordeling!#REF!,\"\")","v":{"$error":"#REF!"}},{"$f":"IF(AND($A$13>0,Y6<>\"\"),Beoordeling!#REF!,\"\")","v":{"$error":"#REF!"}},{"$f":"IF(AND($A$13>0,Z6<>\"\"),Beoordeling!#REF!,\"\")","v":{"$error":"#REF!"}},{"$f":"IF(AND($A$13>0,AA6<>\"\"),Beoordeling!#REF!,\"\")","v":{"$error":"#REF!"}},{"$f":"IF(AND($A$13>0,AB6<>\"\"),Beoordeling!#REF!,\"\")","v":{"$error":"#REF!"}},{"$f":"IF(AND($A$13>0,AC6<>\"\"),Beoordeling!#REF!,\"\")","v":{"$error":"#REF!"}},{"$f":"IF(AND($A$13>0,AD6<>\"\"),Beoordeling!#REF!,\"\")","v":{"$error":"#REF!"}},{"$f":"IF(AND($A$13>0,AE6<>\"\"),Beoordeling!#REF!,\"\")","v":{"$error":"#REF!"}},{"$f":"IF(AND($A$13>0,AF6<>\"\"),Beoordeling!#REF!,\"\")","v":{"$error":"#REF!"}},{"$f":"IF(AND($A$13>0,AG6<>\"\"),Beoordeling!#REF!,\"\")","v":{"$error":"#REF!"}},{"$f":"IF(AND($A$13>0,AH6<>\"\"),Beoordeling!#REF!,\"\")","v":{"$error":"#REF!"}},null,{"$error":"#REF!"}]
[{"$f":"Beoordeling!#REF!","v":{"$error":"#REF!"}},"H",{"$f":"IF(AND($A$14>0,C6<>\"\"),Beoordeling!#REF!,\"\")","v":{"$error":"#REF!"}},{"$f":"IF(AND($A$14>0,D6<>\"\"),Beoordeling!#REF!,\"\")","v":{"$error":"#REF!"}},{"$f":"IF(AND($A$14>0,E6<>\"\"),Beoordeling!#REF!,\"\")","v":{"$error":"#REF!"}},{"$f":"IF(AND($A$14>0,F6<>\"\"),Beoordeling!#REF!,\"\")","v":{"$error":"#REF!"}},{"$f":"IF(AND($A$14>0,G6<>\"\"),Beoordeling!#REF!,\"\")","v":{"$error":"#REF!"}},{"$f":"IF(AND($A$14>0,H6<>\"\"),Beoordeling!#REF!,\"\")","v":{"$error":"#REF!"}},{"$f":"IF(AND($A$14>0,I6<>\"\"),Beoordeling!#REF!,\"\")","v":{"$error":"#REF!"}},{"$f":"IF(AND($A$14>0,J6<>\"\"),Beoordeling!#REF!,\"\")","v":{"$error":"#REF!"}},{"$f":"IF(AND($A$14>0,K6<>\"\"),Beoordeling!#REF!,\"\")","v":{"$error":"#REF!"}},{"$f":"IF(AND($A$14>0,L6<>\"\"),Beoordeling!#REF!,\"\")","v":{"$error":"#REF!"}},{"$f":"IF(AND($A$14>0,M6<>\"\"),Beoordeling!#REF!,\"\")","v":{"$error":"#REF!"}},{"$f":"IF(AND($A$14>0,N6<>\"\"),Beoordeling!#REF!,\"\")","v":{"$error":"#REF!"}},{"$f":"IF(AND($A$14>0,O6<>\"\"),Beoordeling!#REF!,\"\")","v":{"$error":"#REF!"}},{"$f":"IF(AND($A$14>0,P6<>\"\"),Beoordeling!#REF!,\"\")","v":{"$error":"#REF!"}},{"$f":"IF(AND($A$14>0,Q6<>\"\"),Beoordeling!#REF!,\"\")","v":{"$error":"#REF!"}},{"$f":"IF(AND($A$14>0,R6<>\"\"),Beoordeling!#REF!,\"\")","v":{"$error":"#REF!"}},{"$f":"IF(AND($A$14>0,S6<>\"\"),Beoordeling!#REF!,\"\")","v":{"$error":"#REF!"}},{"$f":"IF(AND($A$14>0,T6<>\"\"),Beoordeling!#REF!,\"\")","v":{"$error":"#REF!"}},{"$f":"IF(AND($A$14>0,U6<>\"\"),Beoordeling!#REF!,\"\")","v":{"$error":"#REF!"}},{"$f":"IF(AND($A$14>0,V6<>\"\"),Beoordeling!#REF!,\"\")","v":{"$error":"#REF!"}},{"$f":"IF(AND($A$14>0,W6<>\"\"),Beoordeling!#REF!,\"\")","v":{"$error":"#REF!"}},{"$f":"IF(AND($A$14>0,X6<>\"\"),Beoordeling!#REF!,\"\")","v":{"$error":"#REF!"}},{"$f":"IF(AND($A$14>0,Y6<>\"\"),Beoordeling!#REF!,\"\")","v":{"$error":"#REF!"}},{"$f":"IF(AND($A$14>0,Z6<>\"\"),Beoordeling!#REF!,\"\")","v":{"$error":"#REF!"}},{"$f":"IF(AND($A$14>0,AA6<>\"\"),Beoordeling!#REF!,\"\")","v":{"$error":"#REF!"}},{"$f":"IF(AND($A$14>0,AB6<>\"\"),Beoordeling!#REF!,\"\")","v":{"$error":"#REF!"}},{"$f":"IF(AND($A$14>0,AC6<>\"\"),Beoordeling!#REF!,\"\")","v":{"$error":"#REF!"}},{"$f":"IF(AND($A$14>0,AD6<>\"\"),Beoordeling!#REF!,\"\")","v":{"$error":"#REF!"}},{"$f":"IF(AND($A$14>0,AE6<>\"\"),Beoordeling!#REF!,\"\")","v":{"$error":"#REF!"}},{"$f":"IF(AND($A$14>0,AF6<>\"\"),Beoordeling!#REF!,\"\")","v":{"$error":"#REF!"}},{"$f":"IF(AND($A$14>0,AG6<>\"\"),Beoordeling!#REF!,\"\")","v":{"$error":"#REF!"}},{"$f":"IF(AND($A$14>0,AH6<>\"\"),Beoordeling!#REF!,\"\")","v":{"$error":"#REF!"}},null,{"$error":"#REF!"}]
[{"$f":"Beoordeling!#REF!","v":{"$error":"#REF!"}},"I",{"$f":"IF(AND($A$15>0,C6<>\"\"),Beoordeling!#REF!,\"\")","v":{"$error":"#REF!"}},{"$f":"IF(AND($A$15>0,D6<>\"\"),Beoordeling!#REF!,\"\")","v":{"$error":"#REF!"}},{"$f":"IF(AND($A$15>0,E6<>\"\"),Beoordeling!#REF!,\"\")","v":{"$error":"#REF!"}},{"$f":"IF(AND($A$15>0,F6<>\"\"),Beoordeling!#REF!,\"\")","v":{"$error":"#REF!"}},{"$f":"IF(AND($A$15>0,G6<>\"\"),Beoordeling!#REF!,\"\")","v":{"$error":"#REF!"}},{"$f":"IF(AND($A$15>0,H6<>\"\"),Beoordeling!#REF!,\"\")","v":{"$error":"#REF!"}},{"$f":"IF(AND($A$15>0,I6<>\"\"),Beoordeling!#REF!,\"\")","v":{"$error":"#REF!"}},{"$f":"IF(AND($A$15>0,J6<>\"\"),Beoordeling!#REF!,\"\")","v":{"$error":"#REF!"}},{"$f":"IF(AND($A$15>0,K6<>\"\"),Beoordeling!#REF!,\"\")","v":{"$error":"#REF!"}},{"$f":"IF(AND($A$15>0,L6<>\"\"),Beoordeling!#REF!,\"\")","v":{"$error":"#REF!"}},{"$f":"IF(AND($A$15>0,M6<>\"\"),Beoordeling!#REF!,\"\")","v":{"$error":"#REF!"}},{"$f":"IF(AND($A$15>0,N6<>\"\"),Beoordeling!#REF!,\"\")","v":{"$error":"#REF!"}},{"$f":"IF(AND($A$15>0,O6<>\"\"),Beoordeling!#REF!,\"\")","v":{"$error":"#REF!"}},{"$f":"IF(AND($A$15>0,P6<>\"\"),Beoordeling!#REF!,\"\")","v":{"$error":"#REF!"}},{"$f":"IF(AND($A$15>0,Q6<>\"\"),Beoordeling!#REF!,\"\")","v":{"$error":"#REF!"}},{"$f":"IF(AND($A$15>0,R6<>\"\"),Beoordeling!#REF!,\"\")","v":{"$error":"#REF!"}},{"$f":"IF(AND($A$15>0,S6<>\"\"),Beoordeling!#REF!,\"\")","v":{"$error":"#REF!"}},{"$f":"IF(AND($A$15>0,T6<>\"\"),Beoordeling!#REF!,\"\")","v":{"$error":"#REF!"}},{"$f":"IF(AND($A$15>0,U6<>\"\"),Beoordeling!#REF!,\"\")","v":{"$error":"#REF!"}},{"$f":"IF(AND($A$15>0,V6<>\"\"),Beoordeling!#REF!,\"\")","v":{"$error":"#REF!"}},{"$f":"IF(AND($A$15>0,W6<>\"\"),Beoordeling!#REF!,\"\")","v":{"$error":"#REF!"}},{"$f":"IF(AND($A$15>0,X6<>\"\"),Beoordeling!#REF!,\"\")","v":{"$error":"#REF!"}},{"$f":"IF(AND($A$15>0,Y6<>\"\"),Beoordeling!#REF!,\"\")","v":{"$error":"#REF!"}},{"$f":"IF(AND($A$15>0,Z6<>\"\"),Beoordeling!#REF!,\"\")","v":{"$error":"#REF!"}},{"$f":"IF(AND($A$15>0,AA6<>\"\"),Beoordeling!#REF!,\"\")","v":{"$error":"#REF!"}},{"$f":"IF(AND($A$15>0,AB6<>\"\"),Beoordeling!#REF!,\"\")","v":{"$error":"#REF!"}},{"$f":"IF(AND($A$15>0,AC6<>\"\"),Beoordeling!#REF!,\"\")","v":{"$error":"#REF!"}},{"$f":"IF(AND($A$15>0,AD6<>\"\"),Beoordeling!#REF!,\"\")","v":{"$error":"#REF!"}},{"$f":"IF(AND($A$15>0,AE6<>\"\"),Beoordeling!#REF!,\"\")","v":{"$error":"#REF!"}},{"$f":"IF(AND($A$15>0,AF6<>\"\"),Beoordeling!#REF!,\"\")","v":{"$error":"#REF!"}},{"$f":"IF(AND($A$15>0,AG6<>\"\"),Beoordeling!#REF!,\"\")","v":{"$error":"#REF!"}},{"$f":"IF(AND($A$15>0,AH6<>\"\"),Beoordeling!#REF!,\"\")","v":{"$error":"#REF!"}},null,{"$error":"#REF!"}]
[null,"eind(%)",{"$f":"IF(C6<>\"\",(SUMPRODUCT($A$7:$A$15,C7:C15))/SUM($A$7:$A$15),\"\")","v":{"$error":"#REF!"}},{"$error":"#REF!"},{"$error":"#REF!"},{"$error":"#REF!"},{"$error":"#REF!"},{"$error":"#REF!"},{"$error":"#REF!"},{"$error":"#REF!"},{"$error":"#REF!"},{"$error":"#REF!"},{"$error":"#REF!"},"","","","","","","","","","","","","","","","","","","","",{"$f":"IF(AH6<>\"\",(SUMPRODUCT($A$7:$A$15,AH7:AH15))/SUM($A$7:$A$15),\"\")","v":""},null,{"$f":"AVERAGE(C16:AH16)","v":{"$error":"#REF!"}}]
[null,"cijfer",{"$f":"IF(C6<>\"\",(SUMPRODUCT($A$7:$A$15,C7:C15)*0.9)/SUM($A$7:$A$15)+10,\"\")","v":{"$error":"#REF!"}},{"$error":"#REF!"},{"$error":"#REF!"},{"$error":"#REF!"},{"$error":"#REF!"},{"$error":"#REF!"},{"$error":"#REF!"},{"$error":"#REF!"},{"$error":"#REF!"},{"$error":"#REF!"},{"$error":"#REF!"},"","","","","","","","","","","","","","","","","","","","",{"$f":"IF(AH6<>\"\",(SUMPRODUCT($A$7:$A$15,AH7:AH15)*0.9)/SUM($A$7:$A$15)+10,\"\")","v":""},null,{"$f":"AVERAGE(C17:AH17)","v":{"$error":"#REF!"}}]